Delorean - Centos9-master (master)

Project Name NVR Tarball SHA Status First failure after success (all commit not built) Number of days since last success
ansible-collections-openstack ansible-collections-openstack-2.6.1-0.20260917161256.da4a211.el9 da4a211b2d1dd147dead0e3db63a373b43b3c09e SUCCESS
ansible-config_template ansible-config_template-3.0.2-0.20261006222037.259ef01.el9 259ef01d69c1830caf3fd5ff3adfae69f0138ae4 SUCCESS
ansible-role-atos-hsm ansible-role-atos-hsm-9.0.0-0.20250317161151.baec445.el9 baec445a57a4bc190ff26907a641ce3e6d4757f0 SUCCESS
ansible-role-collectd-config ansible-role-collectd-config-0.0.2-0.20220810133457.1992666.el9 1992666dad0fd24f7a013cdee7fcae428b94b9d7 SUCCESS
ansible-role-lunasa-hsm ansible-role-lunasa-hsm-9.0.1-0.20250522221721.4a384f4.el9 4a384f4fbed7c93ee2c680bb76fc87ffb0fd8d75 SUCCESS
ansible-role-thales-hsm ansible-role-thales-hsm-9.0.0-0.20250317161655.052f026.el9 052f026e39a04d8116c909360d4ee744231d1aaa SUCCESS
diskimage-builder diskimage-builder-3.43.1-0.20261009221514.cc40811.el9 cc4081122f547c921915e7e3787cf44f10691c4d SUCCESS
edpm-image-builder edpm-image-builder-0.2.1-0.20260908162231.0c43559.el9 0c43559e0dc510f3f10db224af474fc6fb4c8ed3 SUCCESS
gnocchi gnocchi-4.6.7-0.20261013101315.678ec09.el9 678ec091d06963ba2911768c7178cc6b5b3b4021 SUCCESS
openstack-aetos 1d6b55a66208305b9b9ae0f7f03fa9ad60abb726 FAILED 1d6b55a66208305b9b9ae0f7f03fa9ad60abb726 (build log) 38 days
openstack-aodh 77d5b2beec1dac741ba8ddf28efe4eb2dfe882c3 FAILED 7ca49ae9f29215eb1030b7052edd03746c5d6fac (build log) 494 days
openstack-barbican 311ecfa6b8a3bc67831fbb772138c56b35c2359f FAILED 16b8a7cad9fb65478c65c00a5f26ca1417314ed0 (build log) 478 days
openstack-ceilometer 6a90a8c35c51f8e8fa79388e21452b2032645622 FAILED 7d199f5751fc3d0e302cbfdf0c11d778edda45eb (build log) 568 days
openstack-cinder 270ba9ea896827272485526127c2cbcb3a16a3ee FAILED 193d021195723bcad71a8d6acc49f1195ab0ba11 (build log) 403 days
openstack-cloudkitty 3d94c9bbf9758b8a7c8521635c9f2f1807c8b6d5 FAILED 519736a876df72f1d2571ec68846fa45a155bd28 (build log) 488 days
openstack-cloudkitty-ui 9c644eee1cea7685b1042c045dcc1f2155cc0a26 FAILED a9ed2c57fa77cc7ce1c8cd7bf7c9fc8d6e85700b (build log) 578 days
openstack-designate 82da54336847a9856a78c26481b50106ec7c3840 FAILED c1c89d35a15eca75ad70720f253d1e324703d221 (build log) 501 days
openstack-designate-ui 2562abf3bb916f74428fdb8f5eea153b0117a3c8 FAILED 2ad42c8d47d1a5e8c8bcb2be444a75bf363b6a04 (build log) 531 days
openstack-glance 76306ffdb15a76456bc6106a659250e1ae69f4e1 FAILED dac9741c2ecb62a79d9eaf3ed5bffa60f4f8bf69 (build log) 502 days
openstack-heat fe4bc08ebfc4682f9728ff675f111b429681eab0 FAILED f2bf881c05fc81016442bcfb54b194cedfc5d48f (build log) 501 days
openstack-heat-agents openstack-heat-agents-13.1.0-0.20261010161940.d6a951d.el9 d6a951d41647ae8d5929c1958114c645d66c4561 SUCCESS
openstack-heat-ui b645febd83913658afb586501cef6fcb7557e870 FAILED 5c8089e3f18e7b3cceec99d75a8b0c46a52d69da (build log) 506 days
openstack-ironic b084c43ff13f42e5fe84acd2a6351add619826c8 FAILED d498c150ec633c6b82c4b77427ae72f448ebb1f8 (build log) 487 days
openstack-ironic-inspector 7bb56b3c5a8b18f87221edd3405ced2a3571b446 FAILED 7bb56b3c5a8b18f87221edd3405ced2a3571b446 (build log) 394 days
openstack-ironic-python-agent b0cfb69296af0929506001d59a9c3c9744bb5188 FAILED c03021fee25f47ccd2c04e0d91341cd829c9e600 (build log) 548 days
openstack-ironic-python-agent-builder openstack-ironic-python-agent-builder-7.5.0-0.20260920221127.f3fc9a8.el9 f3fc9a869f51579699b363123d4de1bd0001005e SUCCESS
openstack-ironic-staging-drivers openstack-ironic-staging-drivers-0.17.1-0.20250313101138.3a71aaf.el9 3a71aaf0bfbcbdb62d15a6169799aa316155fe4c SUCCESS
openstack-ironic-ui b3ff1ee399b5abbfa52d020fe7e45d17272f7979 FAILED 712a3d4a2d4ebed3c0c08509314fe09c0449fadc (build log) 451 days
openstack-keystone 160d5f577b98d06996a3f460fae9a88df34cdf95 FAILED 9f47af17e18db29d39027f077bfb710cca51ed22 (build log) 519 days
openstack-kolla f738a5e56be543fc5be1bfc4e256544db03fc682 FAILED 35f7b3c3426662877d4f8fc2e3c517697ffba6d9 (build log) 312 days
openstack-macros openstack-macros-2023.1.0-0.20250722161148.ce6a105.el9 ce6a1056773a06cbc81b4fe9982ab5ba7f2c1fec SUCCESS
openstack-magnum 5fca26c307be637ffc3da38a17731c6afb37053b FAILED 6221cd31882a821e26b8a0a40879db045c9f90e1 (build log) 344 days
openstack-magnum-ui debb2daa24236786929a248ee49ea96d748a1bd2 FAILED 533dafa03d3ab5719fc19541a3804ee211f1bdfa (build log) 351 days
openstack-manila a629e5b3fc7d48cdee71c1879a925fc0f21cc7a5 FAILED a02aa6003ed20c409d2a04b5a3365bb2ec6fcf1a (build log) 522 days
openstack-manila-ui f4a2a5f87346b260c3f200e838e480e2a20eb1a5 FAILED cd3bb8570d22a3dbfca1a3539e7e171957ae608c (build log) 549 days
openstack-mistral 70c9e869360a0e836c098f021fe92fa7d39e9ad1 FAILED 46421e9717c8f6ec13a87951388eb741ae3ad074 (build log) 536 days
openstack-mistral-ui f0f5a67edb36e2e5300f31908ac3da56c95135f8 FAILED 7c25ba023cc053b8a9d1a2ddde8daa069b1e592c (build log) 201 days
openstack-neutron 8e0b546521abde0d96e68169a60c043a5053e684 FAILED d3dfe8476d4487e7aecfd581770479df9d36ca64 (build log) 513 days
openstack-neutron-dynamic-routing bd960e7bfbf2ca536d1aa2ad4c8e4a8d5d8a9405 FAILED 446514412b4e516faa15c5c1481e0e4f13cba93d (build log) 578 days
openstack-neutron-fwaas 49ed7218394fc6edded76729b27fdfc100f43653 FAILED ed98cd8a2c87ccac513acfbf448f4795a18aac08 (build log) 509 days
openstack-neutron-vpnaas 5ada2551b26ace4081c35b12d1a60fcc74558dfb FAILED 2543cca53552f55ac60f1ca81f90736c8ecc70d8 (build log) 550 days
openstack-nova 0ec0756a55f374ec585ea80485ff094718f53c78 FAILED 110849f7f972d8cb536a9c96c4cb59f06e357eeb (build log) 722 days
openstack-octavia 3a84776790cc68322d1ea0a1e58df71ef688a4e1 FAILED 2395e970399cc95833d1d6258e9da288b5271a1f (build log) 486 days
openstack-octavia-ui 82e28ef46fd0623adff33ba785878b6abe509b82 FAILED d7d66e7f25d3ce0f9d3481a87d159ac346b697c4 (build log) 526 days
openstack-packstack openstack-packstack-26.0.0-0.20251012161134.f581a3d.el9 f581a3d98a79eb43f13ca0e981bead27c336f097 SUCCESS
openstack-placement 7e72a5cdbedf03214c31d2d188951a349e834c94 FAILED 8ca9d58b7c47f2a4dd367acb3a4e8b800b0844f5 (build log) 422 days
openstack-rally 30e2468d0febf5087a6118b26c3b1ecc2bc7ad71 FAILED e658a58890dd4f70c440b6e72e107ecf6ca6b25c (build log) 267 days
openstack-rally-plugins 4841997075252297476f658957ead66a1c0354ab FAILED 48e20b5d55a0ad62fd2d5b62ef39e486c1b6e932 (build log) 513 days
openstack-selinux openstack-selinux-0.8.41-0.20260930161710.ac4a6b7.el9 ac4a6b76ea464f5fa36eabc3a74f71763aa4617c SUCCESS
openstack-swift 3129f9c186328307cf26c2d2923428a95a2f1c73 FAILED 3db8e2d05fd17858e4c2b54ad2813a26e6112d5b (build log) 418 days
openstack-tacker 734f525c5137b32e96b460b4817face3f88e8637 FAILED 0c4d07f95d972c4ba41f396935741d96c501143b (build log) 414 days
openstack-tempest b2b92fc8e808c37cf497fd7067441a38b625b7e9 FAILED 2381404f65c55d1fd7514efdb9c086c480fbd89a (build log) 150 days
openstack-tobiko openstack-tobiko-0.8.33-0.20261016101310.bc94df7.el9 bc94df7842bd07caf3d36ef9c962a4c1c05736eb SUCCESS
openstack-trove 4d45feb3fe7568cc481c1d514560b6652e2d2e1a FAILED 05f68b001ce09f4b99b14d070db1d057fbb51e08 (build log) 466 days
openstack-trove-ui 119d00fc05b71c73b969e5006b66566d5efe838e FAILED 9c736bea660972a9adb0c9088e5ce3869015b058 (build log) 312 days
openstack-vitrage openstack-vitrage-14.1.0-0.20251013161155.652b3d1.el9 652b3d1205620a1f436af77af89e21d4a0d2f9df SUCCESS
openstack-vitrage-ui 37baacc7d7084f3855cf2235ec23938f4bb8c83a FAILED 37baacc7d7084f3855cf2235ec23938f4bb8c83a (build log) 397 days
openstack-watcher 09952c02de25be79169a5db5d1488c1de18790bd FAILED a1e7156c7e8ffe65de56b90634acc031f1bdf35c (build log) 453 days
openstack-watcher-ui 8a42e0fed4e6707ea6609b09662aa8d98c6ac4f8 FAILED 4a0f64b5cbd48af7c44788e0f86e313a6e7865a5 (build log) 516 days
openstack-zaqar 02e3656e68d8b539988534128ea905c7cf281061 FAILED 875041f4a92741aa56e508cc3ef2f36808e95e2b (build log) 499 days
os-apply-config 0e412540f83e0e8efd6c15450e90cd9ab1d45c4a FAILED bd370446f3045cfcd96a86fcd14bce3a208170d1 (build log) 166 days
os-collect-config 06c63361494392cc669c746b333919b4fe21b3cb FAILED fe088654b4650f60903a0fe283dc4785b3b33543 (build log) 20 days
os-net-config os-net-config-18.1.1-0.20261006161534.b39552a.el9 b39552ad326f99f1763a72880f2bb23f3da40728 SUCCESS
os-refresh-config 0c23c0487a42c7283415ff7305e4e98e5ccbebb5 FAILED 90f0a9c3c4c6c0412b5ced24cff41fbea2763caf (build log) 166 days
ovn-bgp-agent ovn-bgp-agent-7.1.0-0.20260913221127.34ba81f.el9 34ba81f84352f8cd0aaae718b065b9371545fa10 SUCCESS
puppet-aodh puppet-aodh-28.0.1-0.20261015223449.14c4a89.el9 14c4a892c377233070e0d9df956f8c535b3eca40 SUCCESS
puppet-apache puppet-apache-13.4.1-0.20261014163028.535ecd7.el9 535ecd71386093475afd5b1acd0230d495bc2c41 SUCCESS
puppet-archive puppet-archive-9.0.0-0.20261016102008.585a6bc.el9 585a6bc45241d4356b6e5d1371045a6bd7fde4dd SUCCESS
puppet-barbican puppet-barbican-28.0.1-0.20261015223918.7878af4.el9 7878af424fe02d3c7b6b82eb49e7bcec42016c51 SUCCESS
puppet-ceilometer puppet-ceilometer-28.0.1-0.20260612161338.a72417b.el9 a72417b3e953c4637ab92fae52350e6d671b2b15 SUCCESS
puppet-ceph puppet-ceph-8.1.1-0.20261016101127.f0e376a.el9 f0e376a19b23b0fe5a6cba3c1813206dd8f7760f SUCCESS
puppet-cinder puppet-cinder-28.0.1-0.20261015223135.c54e911.el9 c54e9116d275698ea779ddd97d1d658160977602 SUCCESS
puppet-concat puppet-concat-10.1.1-0.20261014162314.abb50ef.el9 abb50efed8b6589e32ac4138d86835fc95b4115f SUCCESS
puppet-designate puppet-designate-28.0.1-0.20261015222116.b771d14.el9 b771d1447a361d9efea2c2e61e5fbe8cb7863488 SUCCESS
puppet-dns puppet-dns-12.2.1-0.20261016102100.632d4d0.el9 632d4d0043c57d4e01d26739c68299af63fd6ec2 SUCCESS
puppet-firewall puppet-firewall-8.6.1-0.20261014162410.7a2127b.el9 7a2127bc73143a8a4bb888601467b68e7e72e14f SUCCESS
puppet-glance puppet-glance-28.0.1-0.20261015223009.0ad0410.el9 0ad041031b57761efa43e9417e2ce0662628200d SUCCESS
puppet-gnocchi puppet-gnocchi-28.0.1-0.20261015223310.2bee227.el9 2bee227f94c36e9e2523ef83811fdf25167b1356 SUCCESS
puppet-heat puppet-heat-28.0.1-0.20261015222842.eddb97a.el9 eddb97a3676334868eafed8f88a26e037310323b SUCCESS
puppet-horizon puppet-horizon-28.0.1-0.20260911161546.ea7af3b.el9 ea7af3bedb7532f27daf0adf47ff428ac1397128 SUCCESS
puppet-inifile puppet-inifile-6.5.1-0.20261014162903.c7b92b0.el9 c7b92b02a523285132e071a2f37dfc2b278d38a8 SUCCESS
puppet-ironic puppet-ironic-28.0.1-0.20261015222208.07a9803.el9 07a98039c5de37e9def47b5bf351e5a48f63e166 SUCCESS
puppet-keystone puppet-keystone-28.0.1-0.20261015224059.d8ca78b.el9 d8ca78bac098d807cfa0601e584d6e2cb9539841 SUCCESS
puppet-kmod puppet-kmod-5.0.1-0.20261004221450.d54c4bc.el9 d54c4bc59db46ae77da4398392b1761a98337326 SUCCESS
puppet-magnum puppet-magnum-28.0.1-0.20261015221451.7459461.el9 745946164df0d81abff0ee30a7646e40aa6ae107 SUCCESS
puppet-manila puppet-manila-28.0.1-0.20261015222345.5ec06e8.el9 5ec06e8f4bf77721cf5075b1e2be7d4f56df8776 SUCCESS
puppet-memcached puppet-memcached-11.0.0-0.20251021161741.ae97715.el9 ae977156c4f7187e14256acfcd7a879e1a95eaae SUCCESS
puppet-mistral puppet-mistral-28.0.1-0.20261015222543.4c14ea9.el9 4c14ea97c8c244a40ecd475ce0d88c5620ef97bf SUCCESS
puppet-mysql puppet-mysql-17.3.1-0.20261015161534.1617993.el9 16179933dbddc9af3660c26997dba021ab79f232 SUCCESS
puppet-neutron puppet-neutron-28.0.1-0.20261016221157.a4ee8a5.el9 a4ee8a54bfd2df8a2dbfe772298fcb083f0ae57b SUCCESS
puppet-nova puppet-nova-28.0.1-0.20261015222715.969fbc9.el9 969fbc9877d37091dca379ca17887cb13421ce9d SUCCESS
puppet-nssdb puppet-nssdb-1.0.2-0.20220810224923.2ed2a2d.el9 2ed2a2df59bbeaf9cf628e1a4a499476842282fd SUCCESS
puppet-octavia puppet-octavia-28.0.1-0.20261015221948.4a76ae4.el9 4a76ae44b7ed303030ffc9836234ca76130c9d62 SUCCESS
puppet-openstack_extras puppet-openstack_extras-28.0.1-0.20260612165843.85b43fd.el9 85b43fdad91de25ca93e1a0f10e781f81582c037 SUCCESS
puppet-openstacklib puppet-openstacklib-28.0.1-0.20260910101833.044a9da.el9 044a9da51ef49cf258e07280795486b47c195269 SUCCESS
puppet-oslo puppet-oslo-28.0.1-0.20261015221350.d3377d9.el9 d3377d925d0d2cca715bc1392cbe5680e53e5c63 SUCCESS
puppet-ovn puppet-ovn-28.0.1-0.20260612170016.0e4f5ff.el9 0e4f5ff41c9ef3a0e21fe04b810e6ad1ec3d2909 SUCCESS
puppet-placement puppet-placement-15.0.1-0.20261015223752.2a7e4eb.el9 2a7e4eb0cc5368355b27824ce5d707a2c840e682 SUCCESS
puppet-rabbitmq puppet-rabbitmq-15.0.1-0.20261014101653.07d98b8.el9 07d98b81c3240e7fd8ad24bfc54a29eb9a8f951f SUCCESS
puppet-redis puppet-redis-13.2.0-0.20261016161348.e600ee1.el9 e600ee1fe1f3b83e815afdaba254f781268588ea SUCCESS
puppet-remote puppet-remote-10.0.0-0.20220810222108.7420908.el9 7420908328b832f4b20e1eba44bcccd926da8faa SUCCESS
puppet-rsync puppet-rsync-1.2.1-0.20240611221300.9816e10.el9 9816e10d4b99bff4601158be2e95a8f68278dc50 SUCCESS
puppet-ssh puppet-ssh-15.1.0-0.20260921101521.2eb3cb8.el9 2eb3cb89c74e84898ad5b5a19b86356f1189903a SUCCESS
puppet-stdlib puppet-stdlib-10.1.1-0.20261014162215.ea71202.el9 ea71202708801a1b2f7db368f2b3ea3a599686a1 SUCCESS
puppet-swift puppet-swift-28.0.1-0.20260911161844.553aebf.el9 553aebfab175d47a3710fd54b4c50e57b6b0426a SUCCESS
puppet-sysctl puppet-sysctl-0.0.13-0.20220810205143.847ec1c.el9 847ec1c07ed3e231a48d8816971c0bd4afe7a72b SUCCESS
puppet-systemd puppet-systemd-10.3.1-0.20261015041125.806348e.el9 806348e103af4cc3052362b7cee93548ce1721f9 SUCCESS
puppet-tempest puppet-tempest-28.0.1-0.20260911162007.c3422fc.el9 c3422fc0e1022c40119682cf38e4b64dae047909 SUCCESS
puppet-trove puppet-trove-28.0.1-0.20261015221723.072c7c1.el9 072c7c10021b713ee7d9adbf2bb30a3b8524c5b1 SUCCESS
puppet-vcsrepo puppet-vcsrepo-8.0.1-0.20261014162600.4544b9a.el9 4544b9a908a255dbf9ada7f66ba920abe8b8a736 SUCCESS
puppet-vitrage 346d2b37cfd0f43f7210e150608d53b1977641df FAILED 346d2b37cfd0f43f7210e150608d53b1977641df (build log) 148 days
puppet-vswitch puppet-vswitch-24.0.1-0.20261007221417.ccb81b1.el9 ccb81b1d214505dfb3d248eb29a9459f11f4ce75 SUCCESS
puppet-watcher puppet-watcher-28.0.1-0.20261015221550.4161f94.el9 4161f9478fccfc7f30bd11a7635303a72cca9037 SUCCESS
puppet-xinetd puppet-xinetd-3.4.1-0.20240312180832.6e86db1.el9 6e86db1839d659f8408eee1f38788bcfff2c3953 SUCCESS
puppet-zaqar puppet-zaqar-28.0.1-0.20261015223625.668392b.el9 668392be2b9d67952b503160627974e7885c76dd SUCCESS
python-aodhclient 1f09066319c3fffa680f95745af62c1036c92f7d FAILED e2d611442652ecbeb73574f7a7840f862294345b (build log) 495 days
python-automaton e010fb3a7377fa13fcdff7957ff756cb82c8f694 FAILED c816ae131433bd764fef86664c60921dbaf5fdd7 (build log) 494 days
python-barbican-tests-tempest f370cf0ee9e72ada0f48bf80360b7de851444b8e FAILED e528bf4c8eccfdccdeff1ad7d915412ad4fef4e3 (build log) 181 days
python-barbicanclient 98421c691a1d47054d36145e1d46589e65b61fb4 FAILED d91f496e6a893dc31350546ae465078f09e8d8b1 (build log) 177 days
python-castellan 71018c19f1c9c33bb2981a5b89575a4792fce1a5 FAILED 309c9e3ac35eb500a69e61ad57fbc3e7b998ec87 (build log) 402 days
python-ceilometermiddleware 4c4c8fd8cd3edea6054354a64d0737229f5b43b9 FAILED 8d4f6d00ffaa1d2908f445b0758308aec1c329e1 (build log) 523 days
python-cinder-tests-tempest d4894b4df9916d5f7b1968a4e3093f40af4eed44 FAILED af4212b2eba0c0897017a5175ae4ee5f19b581e4 (build log) 232 days
python-cinderclient d749a9993ad5fc7c992125956ce574fb2a74cd58 FAILED e2d30490444edf773afe6956848986a246dd68aa (build log) 459 days
python-cliff 7b8e5dd270cd4dcdbf86c860fe209544fc7c15c4 FAILED af17b570351c6d1d9ce2a2a8879ba0d93d07ca7d (build log) 590 days
python-cloudkitty-tests-tempest fc8dc2a0011b13729df196f0203d0399627a0d01 FAILED fc8dc2a0011b13729df196f0203d0399627a0d01 (build log) 167 days
python-cloudkittyclient 113db9757ee139ba487f4b97a25e701d2cda6969 FAILED 59dc73588fc117b2f7491f74190e3be76722a51c (build log) 397 days
python-collectd-gnocchi python-collectd-gnocchi-1.7.2-0.20230706120905.de115a7.el9 de115a710d45074f4cfb4b1a18fc565d165d72ff SUCCESS
python-cursive cb85e7da772262379d0c917e12b5799d5fd7dc59 FAILED cd5eb140f6d04958d644180791e90c204ce9f90d (build log) 99 days
python-debtcollector 691aa7d21f9791046e4ba0542ff69d0d45df46d0 FAILED a6fcccdc3562c211df148abea073797b1e1c1e44 (build log) 491 days
python-designate-tests-tempest a34f83a38b45babc2b4766bd2e9e0eb332a31650 FAILED e9efed2c0247ac4f2d83b6d5c762fd2f94ab22f0 (build log) 415 days
python-designateclient 40e5bf4642825851f500a506d6e8536ae6d9f4d5 FAILED c4b2b8822438f6d8b8e29c759407e3b1df644ed7 (build log) 382 days
python-django-horizon e9d6b957c910f384411e21790008c58540725872 FAILED 4fce531860f34b12e1c8e2fde43d30f7a50440a5 (build log) 528 days
python-futurist 5ffbc5bb1d7046545d47194456ed1aec06c4ede9 FAILED 7464c5bd3d209ca497475bbb08c203a8c78f3c48 (build log) 416 days
python-glance-store 83ef75e307a219ff09ca92457799ff3019756c03 FAILED 58e0a43efffcab29cc46acb9faf875b5aaaa8ff5 (build log) 521 days
python-glance-tests-tempest 841dc52c5ea48f744bb4d0bd9d92bc94712f98b3 FAILED 596008a899fe60d66b68cc83a0a21c2a80387a7d (build log) 314 days
python-glanceclient 49008a93872ded4fa75ba11197fa6f3f47438ffd FAILED 0b3a8ab2c79ce60b241e0d105fb10a0288d0d7b6 (build log) 519 days
python-glean python-glean-1.25.2-0.20260128231459.642fffe.el9 642fffe0203a8ffcc2443db529af49f54fb3b94f SUCCESS
python-gnocchiclient python-gnocchiclient-7.2.1-0.20261014161740.a990853.el9 a9908538cd032604a15e22d40226d9d7b1b21dd5 SUCCESS
python-hacking 5cf7c3ec9fdeb7e610cc1373c93a7783e2c323f3 FAILED 822b93c4cc08c0918f3b6f22c43a32288f3869a9 (build log) 346 days
python-hardware 2270d2d01ca25910046a61f7b322c1ed5e844649 FAILED a0b13f7337b8361681e810bc6e51845b52a1fbb2 (build log) 380 days
python-heat-tests-tempest ceb78843237c10cd07342a338b6053db1c3472e3 FAILED 4972024980483a923ba136074968549d9abbb9a7 (build log) 397 days
python-heat-translator 1ce8e7b2a7a716746cd5d40f134f96d79a61fd6f FAILED 098b9db0d478a1c3f713ec75d66e9926457c7374 (build log) 579 days
python-heatclient 49c48866b37d871b492d8ea02351e1e47ac073d2 FAILED 641688276479dff18cb87314835cd91af292f6de (build log) 506 days
python-ironic-inspector-client 6ad8733c0dd666135368c5e78cd2a5d57695b926 FAILED 10ed6342db245766e143e91e382ed2d8d1ff0f7a (build log) 505 days
python-ironic-lib 2939f5dbc4df56b005914dfeecaaa8603b65ef64 FAILED 2939f5dbc4df56b005914dfeecaaa8603b65ef64 (build log) 711 days
python-ironic-prometheus-exporter 4c1769cb92318a611613c54e06fcd86f28831c17 FAILED ca97a0b0fa592fef01d9e2fa71a37031adae83ff (build log) 318 days
python-ironic-tests-tempest 88dbe63b3c77c7c8c7fcfe97b52a5409def4f7ef FAILED 84f0b0513002bd78851d62ad19a0ad146eba3122 (build log) 159 days
python-ironicclient 56614c55174289c590466c9f66dcfada52aeae33 FAILED e6423bc5ef2c064bbf0f6ec4d7fc60f3701bc3c9 (build log) 487 days
python-keystone-tests-tempest 41e16f7f319c5c993ec6997399c5a1523d41f0d4 FAILED a6921676c98c4cb0c8965bffecfaf54a7ef9c8b9 (build log) 394 days
python-keystoneauth1 f89bb1a725150f415fab183770d3f426d6bce3dd FAILED 13ab55fdfdb770dd11de05ed068b9c2dfc319a97 (build log) 506 days
python-keystoneclient b9b7a3dafdc41d214ca80e976c872ecafd3fc37a FAILED be6c5069399179bd749d8edfa90045120936585d (build log) 520 days
python-keystonemiddleware 1af0aa4143bd4ec40d59e7c3c0851fe519723831 FAILED c893b626a252a6c3e18b51fa291bd54ffdb8c501 (build log) 472 days
python-kuryr-lib 137c0763fcec873b6062b3d6b6f3d16b8359a7f4 FAILED 8aaa10aee74d0bfbabb92acdc8de045f5bd1d344 (build log) 274 days
python-magnum-tests-tempest def221c91d399d494831eeafea58958a1805c121 FAILED 8bb98da1dbf0c2ac542cab66d8bf50f5d6efc065 (build log) 173 days
python-magnumclient 6adff3716e64de4b59de7396195d2a18189ac348 FAILED 9040f61debfc0b1503910b35dab163a8debc7625 (build log) 99 days
python-manila-tests-tempest 1e4edd9c79c49b497352b62ad07256fc71adbc2b FAILED d4bc1ff7ce91f58f128b5934f671fed01cfb19f8 (build log) 333 days
python-manilaclient 7ea7b6441e7236b1e0f5b03a3706880faa18ea0f FAILED 2bf13b1425333a39b36fb2da952f6227e1871afd (build log) 459 days
python-metalsmith eaf7ec9be35483794923935f37cd37ccdf0602fa FAILED eaf7ec9be35483794923935f37cd37ccdf0602fa (build log) 397 days
python-microversion-parse f0c37346c0c97798171d4d779a0e9d559fdbe43a FAILED a74d9fcab2975028984e77459fd202e522fe1b26 (build log) 935 days
python-mistral-extra a9e8805471cb6dea23a502b1e7ad5bd4eddc9100 FAILED c19760acc1032599df42f1e76491d04d7510cc38 (build log) 398 days
python-mistral-lib 672986c0944cd61a7ac63f3e43b39afeb4ff5ea2 FAILED c98e93fc6dcdbb7fbd1ed6756054c2561ca394c1 (build log) 496 days
python-mistral-tests-tempest 92d061422cab7c4896005fcefef9248d32cdeca8 FAILED 6507a22d0218b444921a2f93fce2309c21e0c031 (build log) 397 days
python-mistralclient c8874032bcc34cd80c9957414ce08d8d6ed2253e FAILED ab33582eeb2c6764b4f9872caa6d4dbdf4d2d7cd (build log) 402 days
python-monascaclient bef42432f502f18c72cc56d64ca5ea5ae81dadd2 FAILED bef42432f502f18c72cc56d64ca5ea5ae81dadd2 (build log) 755 days
python-networking-bagpipe 6458df58703abf53b3f7dbd4a78e04e3004ca952 FAILED 445cab68b7fd6eb63bfe7a2220a7241a88295aaf (build log) 513 days
python-networking-baremetal 2654d9853be7337fb84663fac0bb84149e3ede19 FAILED 4fab2a6fe956a0cb59174e9c33e63c72c6659804 (build log) 506 days
python-networking-bgpvpn ed31254d07642730731c6b1f2288636cb500fd33 FAILED 5c54dfc036523babbb5757455a555bcce1b8566f (build log) 528 days
python-networking-generic-switch 2f103ed1583771cfcf2fed1eaa13138b8b92d1d2 FAILED bc65733175d34492b804c8228c33cb50293198d3 (build log) 505 days
python-networking-l2gw ede521710052a88d26de96004b3722f4e47090d7 FAILED cd8808d1ff5a145a759ae5163a47bb75ad7b895d (build log) 538 days
python-networking-l2gw-tests-tempest python-networking-l2gw-tests-tempest-0.1.1-0.20260605102610.26df011.el9 26df011d60383b8a885cbf831cecb1743333fefb SUCCESS
python-networking-mlnx ec4e2ff355a5af171c24409cf049657682e11516 FAILED ec4e2ff355a5af171c24409cf049657682e11516 (build log) 242 days
python-networking-sfc 26082b73c7bca1329242e06231c5db20a4ae28f6 FAILED 39c6bd2acbb5cc3652b7a8cc96dcd75782084cad (build log) 549 days
python-neutron-lib 6893d1d8c22bac71813422563beb9374e3b902e0 FAILED cdc293be4cf2ff118f71d6f4fda0019007f31f09 (build log) 326 days
python-neutron-tests-tempest 1f6d1d2b8c3bdf2d532169d820dfb0b4928604a3 FAILED ae235c460f0136d0a109cd1e15d8585a7a667923 (build log) 264 days
python-neutronclient python-neutronclient-14.1.0-0.20261007221127.1a73f13.el9 1a73f13a8b6f12134d0a3654103720f7655f97ab SUCCESS
python-novaclient python-novaclient-18.14.0-0.20261010161540.be2c125.el9 be2c12528cc10c7eacbfa63d3f1ed6852026cad7 SUCCESS
python-observabilityclient 8ba76b125405c01ea97629dbb2f4b4aa4c8d3db9 FAILED 5e7f98b006fefd617d5eb3bac8b0b1175821ab3f (build log) 352 days
python-octavia-lib 23b25ba279a9a7da0dd32ed094d67994ad411eb1 FAILED 5b77739e7924435f38d8d419fd67c5fa9b640f2c (build log) 501 days
python-octavia-tests-tempest dc7c41f49aa9c5dbd556e2403782acb52b077a61 FAILED 4a0d1904954fdb16e70a508fc136f62ea76a8786 (build log) 340 days
python-octaviaclient e55639af0a28791ab9a2f247973eeb83c53b2532 FAILED ddba32a8c0f8bc6173363db040ed23078c660f88 (build log) 494 days
python-openstackclient 56bc1f9e1392d823fa59bf083dbab85fb4911f0c FAILED 525fabe051c47c20612a76a08b6c35491c2f5209 (build log) 892 days
python-openstacksdk 01384c4a3cd9f6af5c325230898f4e16c4eb0427 FAILED 9892f1f9d51c062fd9379c5622ccd7eeb145f93a (build log) 913 days
python-os-brick b6c49eea9e3b5b5e374682b1f83c130bfc2797e2 FAILED b1cabce9ecf5c0cc6bd4d03c6a8e075e0621f08b (build log) 424 days
python-os-client-config f532b1d9688cc4ff93342a140b46e7d1bb3bea53 FAILED d202424fc994124d9ddd0c76c73ac58a48acc66f (build log) 505 days
python-os-faults python-os-faults-0.3.0-0.20241127231409.25b7d10.el9 25b7d106a8cbe705322a0cb61f9391a625ebf98f SUCCESS
python-os-ken c9b5891f2023aeb47a7da7ce4012d8f21a94ab76 FAILED d85897884d8da4c7652635636f109882a8104cb5 (build log) 466 days
python-os-resource-classes python-os-resource-classes-1.1.1-0.20260625161127.70df847.el9 70df84771a5df5c85fd266286a9d5660c41bb94f SUCCESS
python-os-service-types b5a9c64b0bd58d4590f12e055fcbfe480ee757c2 FAILED dbbc06795ce655011dc055f29587bf90f2de03f4 (build log) 612 days
python-os-testr python-os-testr-3.0.1-0.20260622222126.552e812.el9 552e812b22d4631909668d6d121d25a949327d72 SUCCESS
python-os-traits python-os-traits-3.8.1-0.20260814221206.d4ac0c1.el9 d4ac0c177eb3fed815191c86cb3cca5eec6aee45 SUCCESS
python-os-vif c953e8d85010a8ccc34156d6015c210b809c611c FAILED 90f540333f842c30a19aeb45418b7197fa8f0fd7 (build log) 170 days
python-os-win python-os-win-5.9.0-0.20250318101146.318b105.el9 318b1052d30baf7a11335399941c211c553b8c7a SUCCESS
python-osc-lib f9ad4f1a86899a89296c2aee59c846b581df6221 FAILED fe8facf16f172d6de9b010cb81768b796dc21534 (build log) 520 days
python-osc-placement cb6570f6d4dd450d916c5f5d9a6082c7031c50f2 FAILED 83fccc5f4675763a1bbb7ba4f6c46166633f0738 (build log) 156 days
python-oslo-cache 6c1aefb3ea621405392e8ae08caa555d5bf6c5f2 FAILED 68f86a2db8b871fee568a40cb876bfd34fe37c83 (build log) 407 days
python-oslo-concurrency 99df4de1679eed1eafc61f69e4fe748ec2c7f34e FAILED 39afc657c46f389efe47f550075dbdb1c07331ca (build log) 407 days
python-oslo-config c2ea470d31a410fff3ab296de784648d29a2805f FAILED c6f71c611909b0c373dddf9942bcfe7225aa8b12 (build log) 403 days
python-oslo-context 38d8e5d4dad4edfb60ef06fa661ba0e7613c3615 FAILED 54fc8368f3a22d6313988031198292dc167019ad (build log) 401 days
python-oslo-db a91be4f9f0fa5eae4626a3a83e5f116b7107eb12 FAILED da4e2e2e331413e666d0b68be66a904bfa8e3340 (build log) 407 days
python-oslo-i18n 7362b94f1f7c5362a3a9d03457f8f0422207e017 FAILED cb84089bceda34fba2b1b7f266ffb58166984d80 (build log) 407 days
python-oslo-limit 3697b4d0af411abd20d561872277d18d0c887cb4 FAILED 8885597b4baafa0a95e5540e627a463c1267cd6b (build log) 407 days
python-oslo-log d25b970a96aec1c485a408d73e0f6b71c58a5711 FAILED 0186f4a6481fe6e8efb11e6c0ea6eb86d33e0b67 (build log) 515 days
python-oslo-messaging d50893544cdd048b8341957444b9a182ef6af169 FAILED c4589c6665fc44ba26964f7b496cde38c112340b (build log) 407 days
python-oslo-metrics 129038e2fef96eeab35118b988fbb83d1c3ef70c FAILED 266a0409a09baed1d4c0f6ffba66bdb6786d174a (build log) 407 days
python-oslo-middleware b2f6476821dec45324c4d64b527f73ecd1cd0b3f FAILED f2758b6b1f0bf74e9ab656fb266c729090c72810 (build log) 407 days
python-oslo-policy c53ce68e9ccae7d4c6a772ede6e07f27c56cf1a3 FAILED ba86cf446c23b0fa535b3cf310d435a7757ff0ee (build log) 407 days
python-oslo-privsep ce05e5822236a3404c4d7a359cc4271d8291a265 FAILED e71c7c94d60ab2b4ced65f094a9edf69df88641e (build log) 407 days
python-oslo-reports e1e4ea0825a1870d4b085e935cf29e777d092252 FAILED f177d99948e949cdeea4d2d81fe6abee60654d87 (build log) 407 days
python-oslo-rootwrap 3cd1ef0f077a90a577374b06bad3dbaa7f0a1b66 FAILED ad228a34f13ebfdb6356e0211ebae36539d05d16 (build log) 407 days
python-oslo-serialization f93f30fa46cae4a10ccbda1e0e96feaee87e81a2 FAILED 708ee9215ab9c9b85053e833c2e7d42a827dd464 (build log) 407 days
python-oslo-service de44317087882f3d1b1c7e1e924294920cca1447 FAILED 226fe87b907bfa5ec6a20fbff821c89313e61649 (build log) 551 days
python-oslo-upgradecheck 736f162741e3f046df2867e1ae83ecddf52e3418 FAILED 1ee7776f8114b1ad9dec0c27bc3a6df3ac5265cf (build log) 407 days
python-oslo-utils eed93c25be6d66953bc0e36a5289dd242f40a282 FAILED aa96b78154e2f584ab4ae25677bcb367a7fa2e13 (build log) 407 days
python-oslo-versionedobjects e2ffe609f8ab619f653f053015adaf4df8e363c4 FAILED 590235abce2b1aa72734ecfafab176732af4f6ef (build log) 407 days
python-oslo-vmware 04c8f2bdd66174814769b7f832f5024739548483 FAILED 44095667c530215be3453a04d24dfcf199d8e68a (build log) 407 days
python-oslotest c7a361fed1976e42ec5d32839cea0e81cac6c648 FAILED a96e70067738b3b7d429a0d75e083404b333c190 (build log) 493 days
python-osprofiler 400c5327f38c93bcf6f03b5339cce3c6833c97d9 FAILED ff2c6c43c02be0a51efa1e1a3ff0a72c1c508865 (build log) 432 days
python-ovn-octavia-provider 3f6b411dc16e0cd7e0e17641979826df2518d547 FAILED 2c986c27445619fa5c057e378b2ce6b4d7c5a33c (build log) 467 days
python-ovsdbapp c2fe08688728c0f4f784451bc5f604402393508e FAILED e1941ec9a257b6533589c09c0367d88a7943bb61 (build log) 331 days
python-proliantutils python-proliantutils-2.16.3-0.20240626221202.fe2f9c2.el9 fe2f9c2950b283f6fa0018b2b6c85c1928e88276 SUCCESS
python-pycadf 3fda236278ee63817ed41f283cad55a6b6f9c838 FAILED 3a948eaeaf2b698eb259bf5cea2956334590c8b9 (build log) 435 days
python-reno fb190bd73525c2979d31f0d45a9f997ece840d1c FAILED d4e513866a8b2ae4bae0a46d8491bc448e480e06 (build log) 156 days
python-requestsexceptions ee9c107c747be8217999a40ae8462aa16bf3dbab FAILED bb64d8a07b515947cf000c375b017026a01f7a4f (build log) 339 days
python-rsd-lib python-rsd-lib-1.2.0-0.20250310161310.6090753.el9 609075345c20e5249098508aa4448470f2b5aa1a SUCCESS
python-rsdclient python-rsdclient-1.0.2-0.20250310162419.d1a515e.el9 d1a515eac062ba9793d74c00091c866514e3668e SUCCESS
python-scciclient python-scciclient-0.16.1-0.20250227113104.cb6eb80.el9 cb6eb80a24bf3914cd9c694899d3e39d138c722e SUCCESS
python-sphinx-feature-classification d74f31d3a552b6f5512d533a753342bce0dae5f6 FAILED 508921899aff0a970dabc5a75af3e5594b6763c9 (build log) 435 days
python-stevedore 849be420e44d47218156adec6ccd9bfa77c4659e FAILED c3d0e852b1043ed66348dc2c03a45ab5fcffc391 (build log) 407 days
python-sushy 6b6cf4d46ca34551a4841ca4472e9a02bd738a52 FAILED 218b3f07a2eac8117810c2f78a6119db13c1ba6f (build log) 379 days
python-sushy-oem-idrac python-sushy-oem-idrac-6.0.1-0.20240903163230.585703a.el9 585703a22c8bb93064286ed7f7127c3bcb294540 SUCCESS
python-sushy-tools 57de2ec0e2711445218a12c831a3ca9a1348f5c2 FAILED ebef351f5139ab7eda69f898f8fe2e5df86a0c10 (build log) 394 days
python-swiftclient python-swiftclient-4.12.0-0.20261014161301.eec02fd.el9 eec02fdcaba420e46cf70fdf55fc1cd094ff4117 SUCCESS
python-tackerclient python-tackerclient-2.5.0-0.20251128171141.13edf78.el9 13edf78fff7f786e765547ceb5cb9e88418801b3 SUCCESS
python-tap-as-a-service a19e30a784ebfb64966941d98b649716709cd6c7 FAILED edff808e94bb8b2f5387b41ea4b31e4c18832862 (build log) 530 days
python-taskflow 571351cd04545ec10001ad268e7c3097244c549c FAILED 2d700ddbd6df270700e48965aafba6eb3cd31f99 (build log) 407 days
python-tcib python-tcib-0.5.1-0.20260903161459.107d1b0.el9 107d1b0889f9a398544c7426f4cce7ce1a18c704 SUCCESS
python-telemetry-tests-tempest 0037426bafafd4b6cf0926f17ae601620643b887 FAILED 56c99c392ad08e3209847fb1324f9721f61814c5 (build log) 335 days
python-tempestconf python-tempestconf-3.5.4-0.20260605221130.66ea243.el9 66ea243053f2b7a0abc015164baa4a338d4a2621 SUCCESS
python-tooz 00a71d79d1022c95cccc62b4cb3be12a48c0f121 FAILED 694619e66957c6f94e8b3a3c55bed722b9bb4679 (build log) 508 days
python-trove-tests-tempest 5bdf4b4157b9ad0c57d3670d170c8308332885af FAILED 13c53e4157df14e37a7626bb53500b01cdd97d22 (build log) 270 days
python-troveclient python-troveclient-8.11.1-0.20260929101131.2e1e050.el9 2e1e050276d2a14e95c426600c2e378d6d9085ff SUCCESS
python-virtualbmc 6cc15079b65420afb9a6c4d7e05588768f15f635 FAILED bcea0445ac8320c45837cd12f6d4677c8cdabd73 (build log) 585 days
python-vitrage-tests-tempest 00abd07f08979af7f9219213ca55a29561f6b7ce FAILED 00abd07f08979af7f9219213ca55a29561f6b7ce (build log) 578 days
python-vitrageclient eaf267fbd5fe23e5cbf51d262dd70a6ceea4a5a5 FAILED eaf267fbd5fe23e5cbf51d262dd70a6ceea4a5a5 (build log) 407 days
python-watcher-tests-tempest 0889990c91de9d71ebb1b41527206448d0796cc0 FAILED b15be3a51ed8d9314232dbffed170141395e922a (build log) 358 days
python-watcherclient b23091b75f513e41f59c68e3562f434ac1b2cc55 FAILED adad31627fd6f69762b4a5b9df7dde6f321d6925 (build log) 509 days
python-whitebox-neutron-tests-tempest python-whitebox-neutron-tests-tempest-0.9.2-0.20261016101558.51ae306.el9 51ae3067d07ce3ab3b5a5accf873d6ee35adf5e0 SUCCESS
python-whitebox-tests-tempest python-whitebox-tests-tempest-0.1.1-0.20260701161844.66def1b.el9 66def1bcf85ac6ea0f1c6a8583aef963c206e96c SUCCESS
python-wsme 112aa3033dc41bd53e4dac14187ecb12c318a964 FAILED 5a9b0ba2f96eae59898e5c48d2f0377f5304c28b (build log) 97 days
python-zaqar-tests-tempest 1735001e7b65c846717cbba431cda89b8246ebb8 FAILED 8173a4b345fd13cf39c9263f6d1eef8d03088e4b (build log) 375 days
python-zaqarclient f81c31b666af5cecafa4a61b38af825e838377c5 FAILED edc41d6587bf6af3cadca548349b53999a1afc82 (build log) 497 days